mall-admin-web-master前端项目下载依赖失败解决

碰壁后的总结

  1. pythone 环境 2.XX版本,切记不要3.0以上的。
  2. node 16.x不能太高

错误案例

复制代码
npm ERR! code 1
npm ERR! path D:\workspace\springBootMall\mall-admin-web-master\node_modules\node-sass
npm ERR! command failed
npm ERR! command C:\windows\system32\cmd.exe /d /s /c node scripts/build.js
npm ERR! Building: D:\APPS\nvm\nodejs\node.exe D:\workspace\springBootMall\mall-admin-web-master\node_modules\node-gyp\bin\node-gyp.js rebuild --verbose --libsass_ext= --libsass_cflags= --libsass_ldflags= --libsass_library=
npm ERR! gyp info it worked if it ends with ok
npm ERR! gyp verb cli [
npm ERR! gyp verb cli   'D:\\APPS\\nvm\\nodejs\\node.exe',
npm ERR! gyp verb cli   'D:\\workspace\\springBootMall\\mall-admin-web-master\\node_modules\\node-gyp\\bin\\node-gyp.js',
npm ERR! gyp verb cli   'rebuild',
npm ERR! gyp verb cli   '--verbose',
npm ERR! gyp verb cli   '--libsass_ext=',
npm ERR! gyp verb cli   '--libsass_cflags=',
npm ERR! gyp verb cli   '--libsass_ldflags=',
npm ERR! gyp verb cli   '--libsass_library='
npm ERR! gyp verb cli ]
npm ERR! gyp info using node-gyp@7.1.2
npm ERR! gyp info using node@16.20.2 | win32 | x64
npm ERR! gyp verb command rebuild []
npm ERR! gyp verb command clean []
npm ERR! gyp verb clean removing "build" directory
npm ERR! gyp verb command configure []
npm ERR! gyp verb find Python Python is not set from command line or npm configuration
npm ERR! gyp verb find Python Python is not set from environment variable PYTHON
npm ERR! gyp verb find Python checking if "python3" can be used
npm ERR! gyp verb find Python - executing "python3" to get executable path
npm ERR! gyp verb find Python - "python3" is not in PATH or produced an error
npm ERR! gyp verb find Python checking if "python" can be used
npm ERR! gyp verb find Python - executing "python" to get executable path
npm ERR! gyp verb find Python - "python" is not in PATH or produced an error
npm ERR! gyp verb find Python checking if "python2" can be used
npm ERR! gyp verb find Python - executing "python2" to get executable path
npm ERR! gyp verb find Python - "python2" is not in PATH or produced an error
npm ERR! gyp verb find Python checking if Python is C:\Python37\python.exe
npm ERR! gyp verb find Python - executing "C:\Python37\python.exe" to get version
npm ERR! gyp verb find Python - "C:\Python37\python.exe" could not be run
npm ERR! gyp verb find Python checking if Python is C:\Python27\python.exe
npm ERR! gyp verb find Python - executing "C:\Python27\python.exe" to get version
npm ERR! gyp verb find Python - "C:\Python27\python.exe" could not be run
npm ERR! gyp verb find Python checking if the py launcher can be used to find Python
npm ERR! gyp verb find Python - executing "py.exe" to get Python executable path
npm ERR! gyp verb find Python - "py.exe" is not in PATH or produced an error
npm ERR! gyp ERR! find Python
npm ERR! gyp ERR! find Python Python is not set from command line or npm configuration
npm ERR! gyp ERR! find Python Python is not set from environment variable PYTHON
npm ERR! gyp ERR! find Python checking if "python3" can be used
npm ERR! gyp ERR! find Python - "python3" is not in PATH or produced an error
npm ERR! gyp ERR! find Python checking if "python" can be used
npm ERR! gyp ERR! find Python - "python" is not in PATH or produced an error
npm ERR! gyp ERR! find Python checking if "python2" can be used
npm ERR! gyp ERR! find Python - "python2" is not in PATH or produced an error
npm ERR! gyp ERR! find Python checking if Python is C:\Python37\python.exe
npm ERR! gyp ERR! find Python - "C:\Python37\python.exe" could not be run
npm ERR! gyp ERR! find Python checking if Python is C:\Python27\python.exe
npm ERR! gyp ERR! find Python - "C:\Python27\python.exe" could not be run
npm ERR! gyp ERR! find Python checking if the py launcher can be used to find Python
npm ERR! gyp ERR! find Python - "py.exe" is not in PATH or produced an error
npm ERR! gyp ERR! find Python
npm ERR! gyp ERR! find Python **********************************************************
npm ERR! gyp ERR! find Python You need to install the latest version of Python.
npm ERR! gyp ERR! find Python Node-gyp should be able to find and use Python. If not,
npm ERR! gyp ERR! find Python you can try one of the following options:
npm ERR! gyp ERR! find Python - Use the switch --python="C:\Path\To\python.exe"
npm ERR! gyp ERR! find Python   (accepted by both node-gyp and npm)
npm ERR! gyp ERR! find Python - Set the environment variable PYTHON
npm ERR! gyp ERR! find Python - Set the npm configuration variable python:
npm ERR! gyp ERR! find Python   npm config set python "C:\Path\To\python.exe"
npm ERR! gyp ERR! find Python For more information consult the documentation at:
npm ERR! gyp ERR! find Python https://github.com/nodejs/node-gyp#installation
npm ERR! gyp ERR! find Python **********************************************************
npm ERR! gyp ERR! find Python
npm ERR! gyp ERR! configure error
npm ERR! gyp ERR! stack Error: Could not find any Python installation to use
npm ERR! gyp ERR! stack     at PythonFinder.fail (D:\workspace\springBootMall\mall-admin-web-master\node_modules\node-gyp\lib\find-python.js:302:47)
npm ERR! gyp ERR! stack     at PythonFinder.runChecks (D:\workspace\springBootMall\mall-admin-web-master\node_modules\node-gyp\lib\find-python.js:136:21)
npm ERR! gyp ERR! stack     at PythonFinder.<anonymous> (D:\workspace\springBootMall\mall-admin-web-master\node_modules\node-gyp\lib\find-python.js:200:18)
npm ERR! gyp ERR! stack     at PythonFinder.execFileCallback (D:\workspace\springBootMall\mall-admin-web-master\node_modules\node-gyp\lib\find-python.js:266:16)
npm ERR! gyp ERR! stack     at exithandler (node:child_process:410:5)
npm ERR! gyp ERR! stack     at ChildProcess.errorhandler (node:child_process:422:5)
npm ERR! gyp ERR! stack     at ChildProcess.emit (node:events:513:28)
npm ERR! gyp ERR! stack     at Process.ChildProcess._handle.onexit (node:internal/child_process:291:12)
npm ERR! gyp ERR! stack     at onErrorNT (node:internal/child_process:485:16)
npm ERR! gyp ERR! stack     at processTicksAndRejections (node:internal/process/task_queues:83:21)
npm ERR! gyp ERR! System Windows_NT 10.0.22621
npm ERR! gyp ERR! command "D:\\APPS\\nvm\\nodejs\\node.exe" "D:\\workspace\\springBootMall\\mall-admin-web-master\\node_modules\\node-gyp\\bin\\node-gyp.js" "rebuild" "--verbose" "--libsass_ext=" "--libsass_cflags=" "--libsass_ldflags=" "--libsass_library="
npm ERR! gyp ERR! cwd D:\workspace\springBootMall\mall-admin-web-master\node_modules\node-sass
npm ERR! gyp ERR! node -v v16.20.2
npm ERR! gyp ERR! node-gyp -v v7.1.2
npm ERR! gyp ERR! not ok
npm ERR! Build failed with error code: 1

npm ERR! A complete log of this run can be found in:
npm ERR!     D:\APPS\ToolApp\node16\node_cache\_logs\2024-08-13T14_50_26_564Z-debug-0.log

解决 :

1.删除当前依赖包

复制代码
npm uninstall node-sass sass-loader

2.下载如下版本

复制代码
npm i node-sass@6.0.1 sass-loader@7.0.3

3.如果下载失败,可能是网络问题,换一个源

复制代码
npm set sass_binary_site http://cdn.npm.taobao.org/dist/node-sass

4.下载依赖

复制代码
npm install

5.运行

复制代码
npm run dev
相关推荐
inquisiter8 分钟前
KernelGpt的部分尝试
java·前端·apache
the局外人30 分钟前
用 TRAE 把 Markdown文档 搬到微信公众号
前端
Autumn_ing31 分钟前
AI原型设计工具怎么选?可编辑原型与可运行前端适合什么场景
前端·小程序·产品经理·代码·codex·墨刀ai客户端·ai原型
夕阳_醉了1 小时前
前端通用组件开发全指南|从 0 到 1 打造稳定可复用的业务组件
前端
Amos_Web1 小时前
Rspack 源码解析(三十):SourceMapDevToolPlugin 如何生成并关联 source map
前端
console.log('npc')1 小时前
从0到1实现任务评价统计功能:React + TypeScript 实战指南(小白注释版)
前端·react.js·typescript
IT_陈寒1 小时前
为什么你应该学习React?
前端·人工智能·后端
ZoeLandia1 小时前
React04:事件处理与受控表单
开发语言·前端·react.js·typescript
亿元程序员2 小时前
用AI做了一款微信小游戏,却发现上传不了
前端
Ai-_Man2 小时前
我需要批量导出Poe左边栏所有对话,而不是一条具体的对话内容,你们AI导出鸭可以吗?
开发语言·前端·javascript·人工智能·小程序