Python测试框架Pytest的基础入门

Pytest简介

Pytest is a mature full-featured Python testing tool that helps you write better programs.The pytest framework makes it easy to write small tests, yet scales to support complex functional testing for applications and libraries.

通过官方网站介绍我们可以了解到,Pytest是一个非常成熟的全功能的Python测试框架,主要有以下几个特点:

简单灵活易上手

支持参数化

支持简单的单元测试和复杂的功能测试,还可以用来做自动化测试

具有很多第三方插件,并且可以自定义扩展

测试用例的skip和xfail处理

可以很好的和Jenkins集成

支持运行由Nose、UnitTest编写的测试用例

Pytest安装

直接使用pip命令安装:

python 复制代码
pip install -U pytest    # -U是如果已安装会自动升级最新版本

验证安装结果:

python 复制代码
pytest --version    # 展示当前安装版本

C:\Users\edison>pytest --version
pytest 6.2.5

在Pytest测试框架中,要遵循以下约束:

测试文件名要符合test_.py或_test.py格式(例如test_min.py);

测试类要以Test开头,且不能带有init方法;

在单个测试类中,可以包含一个或多个test_开头的函数。

Pytest测试执行

Pytest进行测试比较简单,我们来看一个实例:

python 复制代码
import pytest    # 导入pytest包

def test_001():    # 函数以test_开头
    print("test_01")

def test_002():
    print("test_02")

if __name__ == '__main__':
    pytest.main(["-v","test_1214.py"])    # 调用pytest的main函数执行测试

这里我们定义了两个测试函数,直接打印出结果,下面执行测试:

python 复制代码
============================= test session starts =============================
platform win32 -- Python 3.8.0, pytest-6.2.5, py-1.11.0, pluggy-1.0.0 -- D:\Code\venv\Scripts\python.exe
cachedir: .pytest_cache
rootdir: D:\Code
collecting ... collected 2 items

test_1214.py::test_001 PASSED                                            [ 50%]
test_1214.py::test_002 PASSED                                            [100%]

============================== 2 passed in 0.11s ==============================

Process finished with exit code 0

输出结果中显示执行了多少条案例、对应的测试模块、通过条数以及执行耗时。

测试类主函数

python 复制代码
pytest.main(["-v","test_1214.py"])

通过Python代码执行pytest.main():

1.直接执行pytest.main() 【自动查找当前目录下,以test_开头的文件或者以_test结尾的py文件】。

2.设置Pytest的执行参数 pytest.main('--html=./report.html','test_login.py')【执行test_login.py文件,并生成html格式的报告】。

main()括号内可传入执行参数和插件参数,通过\[\]进行分割,\[\]内的多个参数通过"逗号,"进行分割:

运行目录及子包下的所有用例 :pytest.main('目录名');

运行指定模块所有用例 :pytest.main('test_reg.py');

运行指定模块指定类指定用例 :pytest.main('test_reg.py::TestClass::test_method') 冒号分割。

-m=xxx: 运行打标签的用例

-reruns=xxx:失败重新运行

-q: 安静模式, 不输出环境信息

-v: 丰富信息模式, 输出更详细的用例执行信息

-s: 显示程序中的print/logging输出

--resultlog=./log.txt 生成log

--junitxml=./log.xml 生成xml报告

断言方法

Pytest断言主要使用Python原生断言方法,主要有以下几种:

== 内容和类型必须同时满足相等

in 实际结果包含预期结果

is 断言前后两个值相等

python 复制代码
import pytest    # 导入pytest包

def add(x,y):    # 定义以test_开头函数
    return x + y

def test_add():
    assert add(1,2) == 3    # 断言成功

str1 = "Python,Java,Ruby"
def test_in():
    assert "PHP" in str1    # 断言失败

if __name__ == '__main__':
    pytest.main(["-v","test_pytest.py"])    # 调用main函数执行测试
python 复制代码
============================= test session starts =============================
platform win32 -- Python 3.8.0, pytest-6.2.5, py-1.11.0, pluggy-1.0.0 -- D:\Code\venv\Scripts\python.exe
cachedir: .pytest_cache
rootdir: D:\Code
collecting ... collected 2 items

test_pytest.py::test_add PASSED                                          [ 50%]
test_pytest.py::test_in FAILED                                           [100%]

================================== FAILURES ===================================
___________________________________ test_in ___________________________________

    def test_in():
>       assert "PHP" in str1
E       AssertionError: assert 'PHP' in 'Python,Java,Ruby'

test_pytest.py:11: AssertionError
=========================== short test summary info ===========================
FAILED test_pytest.py::test_in - AssertionError: assert 'PHP' in 'Python,Java...
========================= 1 failed, 1 passed in 0.18s =========================

Process finished with exit code 0

可以看到运行结果中明确指出了错误原因是"AssertionError",因为PHP不在str1中。

常用命令详解

运行指定案例:

python 复制代码
if __name__ == '__main__':
    pytest.main(["-v","-s","test_1214.py"])

运行当前文件夹包括子文件夹所有用例:

python 复制代码
if __name__ == '__main__':
    pytest.main(["-v","-s","./"])

运行指定文件夹(code目录下所有用例):

python 复制代码
if __name__ == '__main__':
    pytest.main(["-v","-s","code/"])

运行模块中指定用例(运行模块中test_add用例):

python 复制代码
if __name__ == '__main__':
    pytest.main(["-v","-s","test_pytest.py::test_add"])

执行失败的最大次数。使用表达式"--maxfail=num"来实现(注意:表达式中间不能存在空格),表示用例失败总数等于num 时停止运行。

错误信息在一行展示。在实际项目中如果有很多用例执行失败,查看报错信息将会很麻烦。

使用"--tb=line"命令,可以很好解决这个问题。

接口调用

本地写一个查询用户信息的接口,通过Pytest来调用,并进行接口断言。

python 复制代码
# -*- coding: utf-8 -*-
import pytest
import requests

def test_agent():
    r = requests.post(
        url="http://127.0.0.1:9000/get_user",
        data={
            "name": "吴磊",
            "sex": 1
        },
        headers={"Content-Type": "application/json"}
    )
    print(r.text)
    assert r.json()['data']['retCode'] == "00" and r.json()['data']['retMsg'] == "调用成功"

if __name__ == "__main__":
    pytest.main(["-v","test_api.py"])
相关推荐
虎虎(_ _)。゜zzZ4 分钟前
关于字典中的解包问题
python
辛苦才能7 分钟前
C++ map/set 深度解析:从关联式容器的本质到 operator[] 的三重身份
开发语言·c++
全栈弄潮儿²⁰²⁴9 分钟前
Python实战第2期: 变量与数据类型
python·变量·数据类型·python实战
Chen—LSN22 分钟前
C语言——文件操作(2)
c语言·开发语言·c++·经验分享·笔记·算法·c#
纪念 22927 分钟前
C++类和对象(最终篇)
开发语言·c++
程序员yu43 分钟前
会编网络:别被入门教程骗了,Python实用能力不在语法本身
开发语言·python·学习·算法
鬼手点金1 小时前
opencode组件详解-安装方式
人工智能·python·优化器·分析器·nanogpt
Bruce_Liuxiaowei1 小时前
Python 字典默认值完全指南:从 KeyError 到 defaultdict
开发语言·数据结构·python·字典
数据杂坛1 小时前
【Python程序开发系列】一文搞清楚Gunicorn以及和Nginx的区别
python·nginx·gunicorn
zjh9005301 小时前
Visual C++ 2010 安装使用完整包:高手秘籍
python